Target
Lactoylglutathione lyase
Ligand
BDBM50336266
Substrate
Meas. Tech.
ChEMBL_716548 (CHEMBL1670272)
Ki
159000±n/a nM
Citation
 Yuan, MLuo, MSong, YXu, QWang, XCao, YBu, XRen, YHu, X Identification of curcumin derivatives as human glyoxalase I inhibitors: A combination of biological evaluation, molecular docking, 3D-QSAR and molecular dynamics simulation studies. Bioorg Med Chem 19:1189-96 (2011)  
Target
Name:
Lactoylglutathione lyase
Synonyms:
Aldoketomutase Glx I Glyoxalase I LGUL_HUMAN S-D-lactoylglutathione methylglyoxal lyase
Type:
Enzyme
Mol. Mass.:
20772.95
Organism:
Homo sapiens (Human)
Description:
Q04760
Residue:
184
  
Inhibitor
Name:
BDBM50336266
Synonyms:
CHEMBL1669736 | ethyl 2-(4-nitrobenzylidene)-3-oxobutanoate
Type:
Small organic molecule
Emp. Form.:
C13H13NO5
Mol. Mass.:
263.246
SMILES:
CCOC(=O)C(=Cc1ccc(cc1)[N+]([O-])=O)C(C)=O
: