Target
Lactoylglutathione lyase
Ligand
BDBM50336268
Substrate
Meas. Tech.
ChEMBL_716548 (CHEMBL1670272)
Ki
39000±n/a nM
Citation
 Yuan, MLuo, MSong, YXu, QWang, XCao, YBu, XRen, YHu, X Identification of curcumin derivatives as human glyoxalase I inhibitors: A combination of biological evaluation, molecular docking, 3D-QSAR and molecular dynamics simulation studies. Bioorg Med Chem 19:1189-96 (2011)  
Target
Name:
Lactoylglutathione lyase
Synonyms:
Aldoketomutase Glx I Glyoxalase I LGUL_HUMAN S-D-lactoylglutathione methylglyoxal lyase
Type:
Enzyme
Mol. Mass.:
20772.95
Organism:
Homo sapiens (Human)
Description:
Q04760
Residue:
184
  
Inhibitor
Name:
BDBM50336268
Synonyms:
CHEMBL1669738 | diethyl 2,5-diacetylhexa-2,4-dienedioate
Type:
Small organic molecule
Emp. Form.:
C14H18O6
Mol. Mass.:
282.2891
SMILES:
CCOC(=O)C(=CC=C(C(C)=O)C(=O)OCC)C(C)=O
: