Target
Aminopeptidase N
Ligand
BDBM23973
Substrate
Meas. Tech.
ChEMBL_716908 (CHEMBL1670936)
Ki
500±n/a nM
Citation
 Albrecht, SAl-Lakkis-Wehbe, MOrsini, ADefoin, APale, PSalomon, ETarnus, CWeibel, JM Amino-benzosuberone: a novel warhead for selective inhibition of human aminopeptidase-N/CD13. Bioorg Med Chem 19:1434-49 (2011)  
Target
Name:
Aminopeptidase N
Synonyms:
AMPN_HUMAN APN Aminopeptidase CD_antigen=CD13 Myeloid plasma membrane glycoprotein CD13 gp150 | hAPN
Type:
PROTEIN
Mol. Mass.:
109522.63
Organism:
Homo sapiens (Human)
Description:
ChEMBL_1507526
Residue:
967
  
Inhibitor
Name:
BDBM23973
Synonyms:
3-amino-1,2,3,4-tetrahydronaphthalen-2-one hydrochloride | amino-tetralone, 1
Type:
Small organic molecule
Emp. Form.:
C10H11NO
Mol. Mass.:
161.2004
SMILES:
NC1Cc2ccccc2CC1=O
: