Target
Dihydrofolate reductase
Ligand
BDBM50336513
Substrate
Meas. Tech.
ChEMBL_723694 (CHEMBL1677364)
IC50
2.9±n/a nM
Citation
 Bourne, CRBarrow, EWBunce, RABourne, PCBerlin, KDBarrow, WW Inhibition of antibiotic-resistant Staphylococcus aureus by the broad-spectrum dihydrofolate reductase inhibitor RAB1. Antimicrob Agents Chemother 54:3825-33 (2010)  
Target
Name:
Dihydrofolate reductase
Synonyms:
DYR_STAAU Dihydrofolate reductase Tetrahydrofolate dehydrogenase | folA
Type:
Enzyme
Mol. Mass.:
18249.71
Organism:
Staphylococcus aureus
Description:
Residue:
159
  
Inhibitor
Name:
BDBM50336513
Synonyms:
(R)-Iclaprim CHEMBL1236788
Type:
Small organic molecule
Emp. Form.:
C19H22N4O3
Mol. Mass.:
354.403
SMILES:
COc1cc(Cc2cnc(N)nc2N)c2C=C[C@H](Oc2c1OC)C1CC1
: