Target
Sigma non-opioid intracellular receptor 1
Ligand
BDBM50145015
Substrate
Meas. Tech.
ChEMBL_725391 (CHEMBL1676914)
Ki
0.13±n/a nM
Citation
 Abate, CNiso, MLacivita, EMosier, PDToscano, APerrone, R Analogues ofs receptor ligand 1-cyclohexyl-4-[3-(5-methoxy-1,2,3,4-tetrahydronaphthalen-1-yl)propyl]piperazine (PB28) with added polar functionality and reduced lipophilicity for potential use as positron emission tomography radiotracers. J Med Chem 54:1022-32 (2011)  
Target
Name:
Sigma non-opioid intracellular receptor 1
Synonyms:
OPRS1 SIGMAR1 Sigma non-opioid intracellular receptor 1 Sigma1-receptor Sterol isomerase-like protein
Type:
Protein
Mol. Mass.:
25307.17
Organism:
Cavia porcellus (Guinea pig)
Description:
Q60492
Residue:
223
  
Inhibitor
Name:
BDBM50145015
Synonyms:
1-Cyclohexyl-4-[3-((S)-5-methoxy-1,2,3,4-tetrahydro-naphthalen-1-yl)-propyl]-piperazine | CHEMBL419822
Type:
Small organic molecule
Emp. Form.:
C24H38N2O
Mol. Mass.:
370.5713
SMILES:
COc1cccc2[C@H](CCCN3CCN(CC3)C3CCCCC3)CCCc12
: