Target
Substance-P receptor
Ligand
BDBM50336575
Substrate
Meas. Tech.
ChEMBL_725399 (CHEMBL1676922)
Ki
0.331131±n/a nM
Citation
 Di Fabio, RAlvaro, GGriffante, CPizzi, DADonati, DMattioli, MCimarosti, ZGuercio, GMarchioro, CProvera, SZonzini, LMontanari, DMelotto, SGerrard, PATrist, DGRatti, ECorsi, M Discovery and biological characterization of (2R,4S)-1'-acetyl-N-{(1R)-1-[3,5-bis(trifluoromethyl)phenyl]ethyl}-2-(4-fluoro-2-methylphenyl)-N-methyl-4,4'-bipiperidine-1-carboxamide as a new potent and selective neurokinin 1 (NK1) receptor antagonist clinical candidate. J Med Chem 54:1071-9 (2011)  
Target
Name:
Substance-P receptor
Synonyms:
NK-1 receptor NK1 Receptor NK1R_HUMAN Neurokinin-1 (NK-1) SPR TACR1 Tachykinin receptor 1 (NK1) | tachykinin
Type:
G Protein-Coupled Receptor (GPCR)
Mol. Mass.:
46254.43
Organism:
Homo sapiens (Human)
Description:
P25103
Residue:
407
  
Inhibitor
Name:
BDBM50336575
Synonyms:
CHEMBL1672054 | cis-(1'-Acetyl-N-{(1R)-1-[3,5-bis(trifluoromethyl)phenyl]-ethyl}-2-(4-fluoro-2-methylphenyl)-N-methyl-4,4'-bipiperidine-1-carboxamide
Type:
Small organic molecule
Emp. Form.:
C30H35F7N4O2
Mol. Mass.:
616.6133
SMILES:
C[C@@H](N(C)C(=O)N1CC[C@@H](C[C@@H]1c1ccc(F)cc1C)N1CCN(CC1)C(C)=O)c1cc(cc(c1)C(F)(F)F)C(F)(F)F
: