Target
Mu-type opioid receptor
Ligand
BDBM50336597
Substrate
Meas. Tech.
ChEMBL_725617 (CHEMBL1677800)
Ki
0.730±n/a nM
Citation
 Spetea, MWindisch, PGuo, YBileviciute-Ljungar, ISchütz, JAsim, MFBerzetei-Gurske, IPRiba, PKiraly, KFürst, SAl-Khrasani, MSchmidhammer, H Synthesis and pharmacological activities of 6-glycine substituted 14-phenylpropoxymorphinans, a novel class of opioids with high opioid receptor affinities and antinociceptive potencies. J Med Chem 54:980-8 (2011)  
Target
Name:
Mu-type opioid receptor
Synonyms:
MOR-1 Mu-type opioid receptor (MOR) OPRM_RAT Opioid receptor B Ror-b
Type:
G Protein-Coupled Receptor (GPCR)
Mol. Mass.:
44503.11
Organism:
Rattus norvegicus (rat)
Description:
Competition binding assays were carried out using membrane preparations from transfected HN9.10 cells that constitutively expressed the mu opioid receptor.
Residue:
398
  
Inhibitor
Name:
BDBM50336597
Synonyms:
CHEMBL3216475 | [[4,5alpha-Epoxy-3-hydroxy-17-methyl-14beta-[(3-phenylpropyl)oxy]morphinan-6beta-yl]amino]acetic Acid Dihydrochloride
Type:
Small organic molecule
Emp. Form.:
C28H36Cl2N2O5
Mol. Mass.:
551.502
SMILES:
Cl.Cl.[H][C@@]12Oc3c4c(C[C@@]5([H])N(C)CC[C@@]14[C@]5(CC[C@@H]2NCC(O)=O)OCCCc1ccccc1)ccc3O
: