Target
Mu-type opioid receptor
Ligand
BDBM50336670
Substrate
Meas. Tech.
ChEMBL_722917 (CHEMBL1674428)
Ki
0.29±n/a nM
Citation
 Nemoto, TYamamoto, NWatanabe, AFujii, HHasebe, KNakajima, MMochizuki, HNagase, H Synthesis of 6,14-epoxymorphinan derivatives and their pharmacologies. Bioorg Med Chem 19:1205-21 (2011)  
Target
Name:
Mu-type opioid receptor
Synonyms:
M-OR-1 Mu opioid receptor OPIATE Mu OPRM_CAVPO
Type:
Enzyme Catalytic Domain
Mol. Mass.:
11165.58
Organism:
GUINEA PIG
Description:
P97266
Residue:
98
  
Inhibitor
Name:
BDBM50336670
Synonyms:
CHEMBL1672478 | N-[(6beta,14beta-Epoxy-3-hydroxy-17-isobutylmorphinan-6alpha-yl)methyl]benzamide
Type:
Small organic molecule
Emp. Form.:
C28H34N2O3
Mol. Mass.:
446.5812
SMILES:
CC(C)CN1CC[C@]23C[C@]4(CNC(=O)c5ccccc5)CC[C@@]2(O4)[C@H]1Cc1ccc(O)cc31
: