Target
Sodium/glucose cotransporter 2
Ligand
BDBM20880
Substrate
Meas. Tech.
ChEMBL_718745 (CHEMBL1680964)
IC50
0.49±n/a nM
Citation
 Song, KSLee, SHKim, MJSeo, HJLee, JLee, SHJung, MESon, EJLee, MKim, J Synthesis and SAR of Thiazolylmethylphenyl Glucoside as Novel C-Aryl Glucoside SGLT2 Inhibitors ACS Med Chem Lett 2:182-187 (2011)  
Target
Name:
Sodium/glucose cotransporter 2
Synonyms:
Na(+)/glucose cotransporter 2 SGLT2 Sodium-Dependent Glucose Cotransporter 2 (SGLT2) Solute carrier family 5 member 2
Type:
Protein
Mol. Mass.:
72902.00
Organism:
Homo sapiens (Human)
Description:
P31639
Residue:
672
  
Inhibitor
Name:
BDBM20880
Synonyms:
(2S,3R,4R,5S,6R)-2-{4-chloro-3-[(4-ethoxyphenyl)methyl]phenyl}-6-(hydroxymethyl)oxane-3,4,5-triol C-aryl glucoside, 6 Dapagliflozin
Type:
Small organic molecule
Emp. Form.:
C21H25ClO6
Mol. Mass.:
408.873
SMILES:
CCOc1ccc(Cc2cc(ccc2Cl)[C@@H]2O[C@H](CO)[C@@H](O)[C@H](O)[C@H]2O)cc1
: