Target
Aurora kinase B
Ligand
BDBM50337371
Substrate
Meas. Tech.
ChEMBL_726534 (CHEMBL1685429)
Ki
588±n/a nM
Citation
 Akritopoulou-Zanze, IWakefield, BDGasiecki, AKalvin, DJohnson, EFKovar, PDjuric, SW Scaffold oriented synthesis. Part 4: design, synthesis and biological evaluation of novel 5-substituted indazoles as potent and selective kinase inhibitors employing heterocycle forming and multicomponent reactions. Bioorg Med Chem Lett 21:1480-3 (2011)  
Target
Name:
Aurora kinase B
Synonyms:
AIK2 AIM1 ARK2 AURKB_HUMAN Aurora B-INCENP Aurora kinase B (AURKB) STK-1 STK12 Serine/threonine-protein kinase aurora B
Type:
Protein
Mol. Mass.:
39327.72
Organism:
Homo sapiens (Human)
Description:
Q96GD4
Residue:
344
  
Inhibitor
Name:
BDBM50337371
Synonyms:
CHEMBL1682546 | N-benzyl-4-(1H-indazol-5-yl)thiazol-2-amine
Type:
Small organic molecule
Emp. Form.:
C17H14N4S
Mol. Mass.:
306.385
SMILES:
C(Nc1nc(cs1)-c1ccc2[nH]ncc2c1)c1ccccc1
: