Target
Rho-associated protein kinase 2
Ligand
BDBM50337371
Substrate
Meas. Tech.
ChEMBL_726541 (CHEMBL1685436)
Ki
136±n/a nM
Citation
 Akritopoulou-Zanze, IWakefield, BDGasiecki, AKalvin, DJohnson, EFKovar, PDjuric, SW Scaffold oriented synthesis. Part 4: design, synthesis and biological evaluation of novel 5-substituted indazoles as potent and selective kinase inhibitors employing heterocycle forming and multicomponent reactions. Bioorg Med Chem Lett 21:1480-3 (2011)  
Target
Name:
Rho-associated protein kinase 2
Synonyms:
KIAA0619 ROCK2 Rho kinase 2 (ROCKII) Rho-associated protein kinase 2 (ROCK2) Rho-associated protein kinase 2/Transforming protein RhoA Rho-associated, coiled-coil-containing protein kinase II p164 ROCK-2
Type:
Protein
Mol. Mass.:
160885.43
Organism:
Homo sapiens (Human)
Description:
O75116
Residue:
1388
  
Inhibitor
Name:
BDBM50337371
Synonyms:
CHEMBL1682546 | N-benzyl-4-(1H-indazol-5-yl)thiazol-2-amine
Type:
Small organic molecule
Emp. Form.:
C17H14N4S
Mol. Mass.:
306.385
SMILES:
C(Nc1nc(cs1)-c1ccc2[nH]ncc2c1)c1ccccc1
: