Target
Prothrombin
Ligand
BDBM50337477
Substrate
Meas. Tech.
ChEMBL_728395 (CHEMBL1685171)
Ki
1.8±n/a nM
Citation
 Isaacs, RCNewton, CLCutrona, KJMercer, SPPayne, LSStauffer, KJWilliams, PDCook, JJKrueger, JALewis, SDLucas, BJLyle, EALynch, JJMcMasters, DRNaylor-Olsen, AMMichener, MTWallace, AA Design, synthesis and SAR of a series of 1,3,5-trisubstituted benzenes as thrombin inhibitors. Bioorg Med Chem Lett 21:1536-40 (2011)  
Target
Name:
Prothrombin
Synonyms:
Activation peptide fragment 1 Coagulation factor II Prothrombin precursor Thrombin heavy chain | Thrombin light chain
Type:
Protein
Mol. Mass.:
70029.57
Organism:
Homo sapiens (Human)
Description:
P00734
Residue:
622
  
Inhibitor
Name:
BDBM50337477
Synonyms:
CHEMBL1682783 | N-(5-chloro-2-(1H-tetrazol-1-yl)benzyl)-3-(4-isobutylpiperidin-3-yl)-5-methylbenzamide
Type:
Small organic molecule
Emp. Form.:
C25H31ClN6O
Mol. Mass.:
467.006
SMILES:
CC(C)CC1CCNCC1c1cc(C)cc(c1)C(=O)NCc1cc(Cl)ccc1-n1cnnn1
: