Target
Disintegrin and metalloproteinase domain-containing protein 17
Ligand
BDBM50337721
Substrate
Meas. Tech.
ChEMBL_726752 (CHEMBL1686226)
IC50
21±n/a nM
Citation
 De Savi, CPape, ACumming, JGTing, ASmith, PDBurrows, JNMills, MDavies, CLamont, SMilne, DCook, CMoore, PSawyer, YGerhardt, S The design and synthesis of novel N-hydroxyformamide inhibitors of ADAM-TS4 for the treatment of osteoarthritis. Bioorg Med Chem Lett 21:1376-81 (2011)  
Target
Name:
Disintegrin and metalloproteinase domain-containing protein 17
Synonyms:
ADA17_HUMAN CSVP Disintegrin and metalloproteinase domain-containing protein 17 (ADAM17) TNF-alpha convertase TNF-alpha-converting enzyme (TACE) Tumor necrosis factor-α converting enzyme (TACE)
Type:
Enzyme
Mol. Mass.:
93007.89
Organism:
Homo sapiens (Human)
Description:
Residue:
824
  
Inhibitor
Name:
BDBM50337721
Synonyms:
CHEMBL1683454 US10322143, Compound 8g
Type:
Small organic molecule
Emp. Form.:
C25H34F2N4O4S
Mol. Mass.:
524.624
SMILES:
C[C@@H](C[C@@](C)(CS(=O)(=O)N1CCC(CCc2ccc(F)cc2C)CC1)N(O)C=O)c1ncc(F)cn1
: