Target
Collagenase 3
Ligand
BDBM50337725
Substrate
Meas. Tech.
ChEMBL_728836 (CHEMBL1686371)
IC50
260±n/a nM
Citation
 De Savi, CPape, ACumming, JGTing, ASmith, PDBurrows, JNMills, MDavies, CLamont, SMilne, DCook, CMoore, PSawyer, YGerhardt, S The design and synthesis of novel N-hydroxyformamide inhibitors of ADAM-TS4 for the treatment of osteoarthritis. Bioorg Med Chem Lett 21:1376-81 (2011)  
Target
Name:
Collagenase 3
Synonyms:
MMP-13 MMP13_HUMAN Matrix metalloproteinase-13 (MMP-13) | Matrix metalloproteinase-13 (MMP13)
Type:
Enzyme
Mol. Mass.:
53808.06
Organism:
Homo sapiens (Human)
Description:
P45452
Residue:
471
  
Inhibitor
Name:
BDBM50337725
Synonyms:
CHEMBL1683449 US10322143, Compound 8a
Type:
Small organic molecule
Emp. Form.:
C25H31ClF4N4O4S
Mol. Mass.:
595.05
SMILES:
C[C@@H](C[C@@](C)(CS(=O)(=O)N1CCC(CCc2ccc(cc2Cl)C(F)(F)F)CC1)N(O)C=O)c1ncc(F)cn1
: