Target
Cytochrome P450 3A4
Ligand
BDBM50337730
Substrate
Meas. Tech.
ChEMBL_726744 (CHEMBL1686218)
IC50
1.4±n/a nM
Citation
 De Savi, CPape, ACumming, JGTing, ASmith, PDBurrows, JNMills, MDavies, CLamont, SMilne, DCook, CMoore, PSawyer, YGerhardt, S The design and synthesis of novel N-hydroxyformamide inhibitors of ADAM-TS4 for the treatment of osteoarthritis. Bioorg Med Chem Lett 21:1376-81 (2011)  
Target
Name:
Cytochrome P450 3A4
Synonyms:
Albendazole monooxygenase CP3A4_HUMAN CYP3A4 CYPIIIA4 Cytochrome P450 3A4 (CYP3A4) Nifedipine oxidase Taurochenodeoxycholate 6-alpha-hydroxylase
Type:
Enzyme
Mol. Mass.:
57349.57
Organism:
Homo sapiens (Human)
Description:
Residue:
503
  
Inhibitor
Name:
BDBM50337730
Synonyms:
CHEMBL1683443 | N-((2S,4S)-1-(4-(4-fluorophenyl)piperazin-1-ylsulfonyl)-4-(5-fluoropyrimidin-2-yl)pentan-2-yl)-N-hydroxyformamide
Type:
Small organic molecule
Emp. Form.:
C20H25F2N5O4S
Mol. Mass.:
469.505
SMILES:
C[C@@H](C[C@@H](CS(=O)(=O)N1CCN(CC1)c1ccc(F)cc1)N(O)C=O)c1ncc(F)cn1
: