Target
Peptidyl-prolyl cis-trans isomerase D
Ligand
BDBM50022815
Substrate
Meas. Tech.
ChEMBL_729496 (CHEMBL1696293)
Ki
7±n/a nM
Citation
 Gaali, SKozany, CHoogeland, BKlein, MHausch, F. Facile synthesis of a fluorescent cyclosporin a analogue to study cyclophilin 40 and cyclophilin 18 ligands. ACS Med Chem Lett 1:536-539 (2010)  
Target
Name:
Peptidyl-prolyl cis-trans isomerase D
Synonyms:
40 kDa peptidyl-prolyl cis-trans isomerase CYP40 Cyclophilin D (CypD) Cyclophilin-related protein PPID_HUMAN Peptidyl-prolyl cis-trans isomerase D | Rotamase D
Type:
Protein
Mol. Mass.:
40766.62
Organism:
Homo sapiens (Human)
Description:
Q08752
Residue:
370
  
Inhibitor
Name:
BDBM50022815
Synonyms:
(3S,6S,9S,12R,15S,18S,21S,24S,30S,33S)-30-ethyl-33-[(1R,2R,4E)-1-hydroxy-2-methylhex-4-en-1-yl]-1,4,7,10,12,15,19,25,28-nonamethyl-6,9,18,24-tetrakis(2-methylpropyl)-3,21-bis(propan-2-yl)-1,4,7,10,13,16,19,22,25,28,31-undecaazacyclotritriacontan-2,5,8,11,14,17,20,23,26,29,32-undecone 30-Ethyl-33-(1-hydroxy-2-methyl-hex-4-enyl)-6,9,18,24-tetraisobutyl-3,21-diisopropyl-1,4,7,10,12,15,19,25,28-nonamethyl-1,4,7,10,13,16,19,22,25,28,31undecaaza-cyclotritriacontan-2,5,8,11,14,17,20,23,26,29,32-undecaone Cyclosporin A Cyclosproine A US9138393, Cyclosporin A
Type:
Small organic molecule
Emp. Form.:
C62H111N11O12
Mol. Mass.:
1202.6112
SMILES:
CC[C@@H]1NC(=O)[C@H]([C@H](O)[C@H](C)C\C=C\C)N(C)C(=O)[C@H](C(C)C)N(C)C(=O)[C@H](CC(C)C)N(C)C(=O)[C@H](CC(C)C)N(C)C(=O)[C@@H](C)NC(=O)[C@H](C)NC(=O)[C@H](CC(C)C)N(C)C(=O)[C@@H](NC(=O)[C@H](CC(C)C)N(C)C(=O)CN(C)C1=O)C(C)C
: