Target
Ephrin type-A receptor 2
Ligand
BDBM50339608
Substrate
Meas. Tech.
ChEMBL_734984 (CHEMBL1693591)
IC50
11±n/a nM
Target
Name:
Ephrin type-A receptor 2
Synonyms:
ECK EPHA2_HUMAN Epithelial cell kinase | Tyrosine-protein kinase receptor ECK
Type:
PROTEIN
Mol. Mass.:
108260.70
Organism:
Homo sapiens (Human)
Description:
ChEMBL_1505248
Residue:
976
  
Inhibitor
Name:
BDBM50339608
Synonyms:
3-(1-Amino-1-methylethyl)-N-{(2R)-7-[(7-oxo-5,6,7,8-tetrahydro-1,8-naphthyridin-4-yl)oxy]-1,2,3,4-tetrahydronaphthalen-2-yl}-5-(trifluoromethyl)benzamide | CHEMBL1688861
Type:
Small organic molecule
Emp. Form.:
C29H29F3N4O3
Mol. Mass.:
538.5608
SMILES:
CC(C)(N)c1cc(cc(c1)C(F)(F)F)C(=O)N[C@@H]1CCc2ccc(Oc3ccnc4NC(=O)CCc34)cc2C1
: