Target
D(3) dopamine receptor
Ligand
BDBM50339685
Substrate
Meas. Tech.
ChEMBL_735244 (CHEMBL1694506)
Ki
0.17±n/a nM
Citation
 Tu, ZLi, SCui, JXu, JTaylor, MHo, DLuedtke, RRMach, RH Synthesis and pharmacological evaluation of fluorine-containing D3 dopamine receptor ligands. J Med Chem 54:1555-64 (2011)  
Target
Name:
D(3) dopamine receptor
Synonyms:
DOPAMINE D3 DRD3_HUMAN Dopamine D3 receptor (D3) Dopamine receptor Dopamine receptor D3
Type:
Mol. Mass.:
44243.43
Organism:
Homo sapiens (Human)
Description:
Residue:
400
  
Inhibitor
Name:
BDBM50339685
Synonyms:
4-(Thiophen-3-yl)-N-(4-(4-(2-(2-fluoroethoxy)phenyl)piperazin-1-yl)butyl)benzamide oxalic acid salt | CHEMBL1689006
Type:
Small organic molecule
Emp. Form.:
C27H32FN3O2S
Mol. Mass.:
481.625
SMILES:
FCCOc1ccccc1N1CCN(CCCCNC(=O)c2ccc(cc2)-c2ccsc2)CC1
: