Target
Coagulation factor X
Ligand
BDBM50339706
Substrate
Meas. Tech.
ChEMBL_735257 (CHEMBL1694519)
Ki
1.3±n/a nM
Citation
 Watson, NSAdams, CBelton, DBrown, DBurns-Kurtis, CLChaudry, LChan, CConvery, MADavies, DEExall, AMHarling, JDIrvine, SIrving, WRKleanthous, SMcLay, IMPateman, AJPatikis, ANRoethke, TJSenger, SStelman, GJToomey, JRWest, RIWhittaker, CZhou, PYoung, RJ The discovery of potent and long-acting oral factor Xa inhibitors with tetrahydroisoquinoline and benzazepine P4 motifs. Bioorg Med Chem Lett 21:1588-92 (2011)  
Target
Name:
Coagulation factor X
Synonyms:
Activated coagulation factor X (FXa) Coagulation factor X precursor F10 Factor X heavy chain Factor Xa Stuart-Prower factor
Type:
Enzyme
Mol. Mass.:
54726.60
Organism:
Homo sapiens (Human)
Description:
Residue:
488
  
Inhibitor
Name:
BDBM50339706
Synonyms:
(S)-6-chloro-N-(1-(5-fluoro-1,2,3,4-tetrahydroisoquinolin-6-yl)-2-oxopyrrolidin-3-yl)naphthalene-2-sulfonamide CHEMBL1615104
Type:
Small organic molecule
Emp. Form.:
C23H21ClFN3O3S
Mol. Mass.:
473.948
SMILES:
Fc1c2CCNCc2ccc1N1CC[C@H](NS(=O)(=O)c2ccc3cc(Cl)ccc3c2)C1=O
: