Target
Carbonic anhydrase 2
Ligand
BDBM26988
Substrate
Meas. Tech.
ChEMBL_735671 (CHEMBL1693486)
pH
7.5±n/a
Ki
35000000±n/a nM
Comments
extracted
Citation
 Cincinelli, AMartellini, TInnocenti, AScozzafava, ASupuran, CT Purification and inhibition studies with anions and sulfonamides of ana-carbonic anhydrase from the Antarctic seal Leptonychotes weddellii. Bioorg Med Chem 19:1847-51 (2011)  
Target
Name:
Carbonic anhydrase 2
Synonyms:
CA-II CAC Carbonate dehydratase II Carbonic anhydrase 2 (CA-II) Carbonic anhydrase C Carbonic anhydrase II (CA-II) Carbonic anhydrase II (hCA II) | Carbonic anhydrase isoenzyme II (hCA II)
Type:
Enzyme
Mol. Mass.:
29250.71
Organism:
Homo sapiens (Human)
Description:
P00918
Residue:
260
  
Inhibitor
Name:
BDBM26988
Synonyms:
CHEMBL1644029 CHEMBL186200 nitrate ion | nitrooxidane
Type:
Ion
Emp. Form.:
NO3
Mol. Mass.:
62.0054
SMILES:
[O-][N+]([O-])=O
: