Target
Acetylcholinesterase
Ligand
BDBM10624
Substrate
Meas. Tech.
ChEMBL_739676 (CHEMBL1763502)
Ki
10±n/a nM
Citation
 Komloova, MMusilek, KHorova, AHolas, ODohnal, VGunn-Moore, FKuca, K Preparation, in vitro screening and molecular modelling of symmetrical bis-quinolinium cholinesterase inhibitors--implications for early myasthenia gravis treatment. Bioorg Med Chem Lett 21:2505-9 (2011)  
Target
Name:
Acetylcholinesterase
Synonyms:
ACES_HUMAN Acetylcholinesterase (AChE) | Acetylcholinesterase (human AChE)
Type:
Enzyme
Mol. Mass.:
67792.70
Organism:
Homo sapiens (Human)
Description:
P22303
Residue:
614
  
Inhibitor
Name:
BDBM10624
Synonyms:
1,5-bis(4-allyldimethylammoniumphenyl)-pentan-3-one dibromide BW284c51 CHEMBL464538
Type:
Small organic molecule
Emp. Form.:
C27H38N2O
Mol. Mass.:
406.6023
SMILES:
C[N+](C)(CC=C)c1ccc(CCC(=O)CCc2ccc(cc2)[N+](C)(C)CC=C)cc1
: