Target
Cannabinoid receptor 2
Ligand
BDBM50340317
Substrate
Meas. Tech.
ChEMBL_741484 (CHEMBL1763799)
IC50
21±n/a nM
Citation
 Trotter, BWNanda, KKBurgey, CSPotteiger, CMDeng, JZGreen, AIHartnett, JCKett, NRWu, ZHenze, DADella Penna, KDesai, RLeitl, MDLemaire, WWhite, RBYeh, SUrban, MOKane, SAHartman, GDBilodeau, MT Imidazopyridine CB2 agonists: optimization of CB2/CB1 selectivity and implications for in vivo analgesic efficacy. Bioorg Med Chem Lett 21:2354-8 (2011)  
Target
Name:
Cannabinoid receptor 2
Synonyms:
CANNABINOID CB2 CB2 CB2B CNR2_HUMAN Cannabinoid CB2 receptor Cannabinoid receptor 2 (CB2R) | hCB2
Type:
G Protein-Coupled Receptor (GPCR)
Mol. Mass.:
39690.94
Organism:
Homo sapiens (Human)
Description:
P34972
Residue:
360
  
Inhibitor
Name:
BDBM50340317
Synonyms:
3-cyclopropyl-N-neopentylimidazo[1,5-a]pyridine-1-carboxamide | CHEMBL1760937
Type:
Small organic molecule
Emp. Form.:
C16H21N3O
Mol. Mass.:
271.3574
SMILES:
CC(C)(C)CNC(=O)c1nc(C2CC2)n2ccccc12
: