Target
11-beta-hydroxysteroid dehydrogenase type 2
Ligand
BDBM50174285
Substrate
Meas. Tech.
ChEMBL_740938 (CHEMBL1764082)
IC50
2100±n/a nM
Citation
 Maletic, MLeeman, ASzymonifka, MMundt, SSZokian, HJShah, KDragovic, JLyons, KThieringer, RVosatka, AHBalkovec, JWaddell, ST Bicyclo[2.2.2]octyltriazole inhibitors of 11β-hydoxysteroid dehydrogenase type 1. Pharmacological agents for the treatment of metabolic syndrome. Bioorg Med Chem Lett 21:2568-72 (2011)  
Target
Name:
11-beta-hydroxysteroid dehydrogenase type 2
Synonyms:
11-DH2 11-beta-Hydroxysteroid Dehydrogenase 2 (11-beta-HSD2) Corticosteroid 11-beta-dehydrogenase isozyme 2 Hsd11b2 NAD-dependent 11-beta-hydroxysteroid dehydrogenase
Type:
Enzyme
Mol. Mass.:
42201.46
Organism:
Mus musculus (mouse)
Description:
Purified recombinant mouse 11beta-HSD2.
Residue:
386
  
Inhibitor
Name:
BDBM50174285
Synonyms:
3-(4-pentylbicyclo[2.2.2]octan-1-yl)-5,6,7,8,9,10-hexahydro-[1,2,4]triazolo[4,3-a]azocine | CHEMBL200513
Type:
Small organic molecule
Emp. Form.:
C21H35N3
Mol. Mass.:
329.5227
SMILES:
CCCCCC12CCC(CC1)(CC2)c1nnc2CCCCCCn12
: