Target
Botulinum neurotoxin type A
Ligand
BDBM50340404
Substrate
Meas. Tech.
ChEMBL_741005 (CHEMBL1764191)
Ki
800±n/a nM
Citation
 Šilhár, PAlakurtti, SCapková, KXiaochuan, FShoemaker, CBYli-Kauhaluoma, JJanda, KD Synthesis and evaluation of library of betulin derivatives against the botulinum neurotoxin A protease. Bioorg Med Chem Lett 21:2229-31 (2011)  
Target
Name:
Botulinum neurotoxin type A
Synonyms:
BXA1_CLOBO bonT | botA
Type:
PROTEIN
Mol. Mass.:
149450.01
Organism:
Clostridium botulinum
Description:
ChEMBL_1510137
Residue:
1296
  
Inhibitor
Name:
BDBM50340404
Synonyms:
28-Hemisuccinylbetulin | CHEMBL1761333
Type:
Small organic molecule
Emp. Form.:
C34H54O5
Mol. Mass.:
542.7896
SMILES:
CC(=C)[C@@H]1CC[C@]2(COC(=O)CCC(O)=O)CC[C@]3(C)[C@H](CC[C@@H]4[C@@]5(C)CC[C@H](O)C(C)(C)[C@@H]5CC[C@@]34C)[C@@H]12
: