Target
11-beta-hydroxysteroid dehydrogenase 1
Ligand
BDBM50340445
Substrate
Meas. Tech.
ChEMBL_741129 (CHEMBL1764400)
IC50
75±n/a nM
Citation
 Venier, OPascal, CBraun, ANamane, CMougenot, PCrespin, OPacquet, FMougenot, CMonseau, COnofri, BDadji-Faïhun, RLeger, CBen-Hassine, MVan-Pham, TRagot, JLPhilippo, CGüssregen, SEngel, CFarjot, GNoah, LManiani, KNicolaï, E Pyrrolidine-pyrazole ureas as potent and selective inhibitors of 11β-hydroxysteroid-dehydrogenase type 1. Bioorg Med Chem Lett 21:2244-51 (2011)  
Target
Name:
11-beta-hydroxysteroid dehydrogenase 1
Synonyms:
11-DH 11-beta-Hydroxysteroid Dehydrogenase 1 (11-beta-HSD1) 11beta-HSD1A Corticosteroid 11-beta-dehydrogenase isozyme 1 (11-beta-HSD-1) Hsd11 | Hsd11b1
Type:
Enzyme
Mol. Mass.:
32369.70
Organism:
Mus musculus (mouse)
Description:
P50172
Residue:
292
  
Inhibitor
Name:
BDBM50340445
Synonyms:
4-(4-(3-(1H-pyrazol-4-yl)pyrrolidine-1-carbonyl)-3,4-dihydroquinoxalin-1(2H)-yl)benzonitrile | CHEMBL1761865
Type:
Small organic molecule
Emp. Form.:
C23H22N6O
Mol. Mass.:
398.4604
SMILES:
O=C(N1CCC(C1)c1cn[nH]c1)N1CCN(c2ccc(cc2)C#N)c2ccccc12
: