Target
11-beta-hydroxysteroid dehydrogenase 1
Ligand
BDBM50340448
Substrate
Meas. Tech.
ChEMBL_741128 (CHEMBL1764399)
IC50
436±n/a nM
Citation
 Venier, OPascal, CBraun, ANamane, CMougenot, PCrespin, OPacquet, FMougenot, CMonseau, COnofri, BDadji-Faïhun, RLeger, CBen-Hassine, MVan-Pham, TRagot, JLPhilippo, CGüssregen, SEngel, CFarjot, GNoah, LManiani, KNicolaï, E Pyrrolidine-pyrazole ureas as potent and selective inhibitors of 11β-hydroxysteroid-dehydrogenase type 1. Bioorg Med Chem Lett 21:2244-51 (2011)  
Target
Name:
11-beta-hydroxysteroid dehydrogenase 1
Synonyms:
11-DH 11-beta-Hydroxysteroid Dehydrogenase 1 (11-beta-HSD1) 11-beta-hydroxysteroid dehydrogenase 1 (11HSD1) Corticosteroid 11-beta-dehydrogenase isozyme 1 (11-beta-HSD-1) Corticosteroid 11-beta-dehydrogenase isozyme 1 (11beta-HSD1) HSD11 HSD11L | SDR26C1
Type:
Enzyme
Mol. Mass.:
32409.16
Organism:
Homo sapiens (Human)
Description:
P28845
Residue:
292
  
Inhibitor
Name:
BDBM50340448
Synonyms:
(3,4-dihydroquinolin-1(2H)-yl)(4-(1-methyl-1H-pyrazol-4-yl)piperidin-1-yl)methanone | CHEMBL1761849
Type:
Small organic molecule
Emp. Form.:
C19H24N4O
Mol. Mass.:
324.4201
SMILES:
Cn1cc(cn1)C1CCN(CC1)C(=O)N1CCCc2ccccc12
: