Target
11-beta-hydroxysteroid dehydrogenase 1
Ligand
BDBM50340437
Substrate
Meas. Tech.
ChEMBL_741128 (CHEMBL1764399)
IC50
40±n/a nM
Citation
 Venier, OPascal, CBraun, ANamane, CMougenot, PCrespin, OPacquet, FMougenot, CMonseau, COnofri, BDadji-Faïhun, RLeger, CBen-Hassine, MVan-Pham, TRagot, JLPhilippo, CGüssregen, SEngel, CFarjot, GNoah, LManiani, KNicolaï, E Pyrrolidine-pyrazole ureas as potent and selective inhibitors of 11β-hydroxysteroid-dehydrogenase type 1. Bioorg Med Chem Lett 21:2244-51 (2011)  
Target
Name:
11-beta-hydroxysteroid dehydrogenase 1
Synonyms:
11-DH 11-beta-Hydroxysteroid Dehydrogenase 1 (11-beta-HSD1) 11-beta-hydroxysteroid dehydrogenase 1 (11HSD1) Corticosteroid 11-beta-dehydrogenase isozyme 1 (11-beta-HSD-1) Corticosteroid 11-beta-dehydrogenase isozyme 1 (11beta-HSD1) HSD11 HSD11L | SDR26C1
Type:
Enzyme
Mol. Mass.:
32409.16
Organism:
Homo sapiens (Human)
Description:
P28845
Residue:
292
  
Inhibitor
Name:
BDBM50340437
Synonyms:
CHEMBL1761857 | Endo-((1R,5S)-3-(1H-pyrazol-3-yl)-8-azabicyclo[3.2.1]octan-8-yl)(3,4-dihydroquinolin-1(2H)-yl)methanone
Type:
Small organic molecule
Emp. Form.:
C20H24N4O
Mol. Mass.:
336.4308
SMILES:
O=C(N1[C@H]2CC[C@@H]1C[C@@H](C2)c1ccn[nH]1)N1CCCc2ccccc12
: