Target
Cyclin-dependent kinase 5 activator 1
Ligand
BDBM50155426
Substrate
Meas. Tech.
ChEMBL_739719 (CHEMBL1763545)
IC50
200±n/a nM
Citation
 Laha, JKZhang, XQiao, LLiu, MChatterjee, SRobinson, SKosik, KSCuny, GD Structure-activity relationship study of 2,4-diaminothiazoles as Cdk5/p25 kinase inhibitors. Bioorg Med Chem Lett 21:2098-101 (2011)  
Target
Name:
Cyclin-dependent kinase 5 activator 1
Synonyms:
CDK5/p35 Cyclin-dependent kinase 5 regulatory subunit 1 | Cyclin-dependent kinase 5/CDK5 activator 1
Type:
Protein Complex
Mol. Mass.:
Description:
Components:
This complex has 2 components.
Component 1
Name:
Cyclin-dependent kinase 5
Synonyms:
CDK5 CDKN5 Cyclin-dependent kinase 5 (CDK5/ p25) Cyclin-dependent-like kinase 5 PSSALRE Tau protein kinase II catalytic subunit
Type:
Enzyme Subunit
Mol. Mass.:
33308.61
Organism:
Homo sapiens (Human)
Description:
Residue:
292
  
Component 2
Name:
Cyclin-dependent kinase 5 activator 1
Synonyms:
CD5R1_HUMAN CDK5R1 Cyclin-dependent kinase 5 (CDK5/p25) NCK5A p35
Type:
Enzyme Subunit
Mol. Mass.:
34077.43
Organism:
Homo sapiens (Human)
Description:
Q15078
Residue:
307
  
Inhibitor
Name:
BDBM50155426
Synonyms:
1,3,5,8-Tetrahydroxy-xanthen-9-one CHEMBL184574 Xanthen-9-one, 1.0
Type:
Small organic molecule
Emp. Form.:
C13H8O6
Mol. Mass.:
260.199
SMILES:
Oc1cc(O)c2c(c1)oc1c(O)ccc(O)c1c2=O
: