Target
TGF-beta receptor type-1
Ligand
BDBM50341250
Substrate
Meas. Tech.
ChEMBL_742332 (CHEMBL1768781)
IC50
<10000±n/a nM
Citation
 Medina, JRBecker, CJBlackledge, CWDuquenne, CFeng, YGrant, SWHeerding, DLi, WHMiller, WHRomeril, SPScherzer, DShu, ABobko, MAChadderton, ARDumble, MGardiner, CMGilbert, SLiu, QRabindran, SKSudakin, VXiang, HBrady, PGCampobasso, NWard, PAxten, JM Structure-based design of potent and selective 3-phosphoinositide-dependent kinase-1 (PDK1) inhibitors. J Med Chem 54:1871-95 (2011)  
Target
Name:
TGF-beta receptor type-1
Synonyms:
ALK-5 Activin A receptor type II-like protein kinase of 53kD SKR4 TGF-beta receptor type I TGFBR1 TGFR1_HUMAN Transforming growth factor-beta receptor type I
Type:
enzyme
Mol. Mass.:
55968.24
Organism:
Homo sapiens (Human)
Description:
P36897
Residue:
503
  
Inhibitor
Name:
BDBM50341250
Synonyms:
CHEMBL1765751 | N-{(3R,5R)-1-[2-Amino-6-(3-amino-1H-indazol-6-yl)-4-pyrimidinyl]-5-methyl-3-piperidinyl}-N,3,3-trimethylbutanamide
Type:
Small organic molecule
Emp. Form.:
C24H34N8O
Mol. Mass.:
450.5798
SMILES:
C[C@@H]1C[C@H](CN(C1)c1cc(nc(N)n1)-c1ccc2c(N)n[nH]c2c1)N(C)C(=O)CC(C)(C)C
: