Target
3-phosphoinositide-dependent protein kinase 1
Ligand
BDBM50418250
Substrate
Meas. Tech.
ChEMBL_742334 (CHEMBL1768783)
IC50
25±n/a nM
Citation
 Medina, JRBecker, CJBlackledge, CWDuquenne, CFeng, YGrant, SWHeerding, DLi, WHMiller, WHRomeril, SPScherzer, DShu, ABobko, MAChadderton, ARDumble, MGardiner, CMGilbert, SLiu, QRabindran, SKSudakin, VXiang, HBrady, PGCampobasso, NWard, PAxten, JM Structure-based design of potent and selective 3-phosphoinositide-dependent kinase-1 (PDK1) inhibitors. J Med Chem 54:1871-95 (2011)  
Target
Name:
3-phosphoinositide-dependent protein kinase 1
Synonyms:
3-Phosphoinositide-Dependent Protein Kinase 1 (PDK1) 3-phosphoinositide-dependent protein kinase 1 3-phosphoinositide-dependent protein kinase 1 (PDK-1) Isoform 2 of 3-phosphoinositide-dependent protein kinase 1 PDPK1 Phosphoinositide-dependent protein kinase 1 (PDK1) hPDK1
Type:
Enzyme
Mol. Mass.:
63157.65
Organism:
Homo sapiens (Human)
Description:
O15530
Residue:
556
  
Inhibitor
Name:
BDBM50418250
Synonyms:
CHEMBL1765748
Type:
Small organic molecule
Emp. Form.:
C21H28N8O2
Mol. Mass.:
424.4994
SMILES:
CC(C)(C)OC(=O)N[C@@H]1CCCN(C1)c1cc(nc(N)n1)-c1ccc2c(N)n[nH]c2c1
: