Target
Mitogen-activated protein kinase 14
Ligand
BDBM50341370
Substrate
Meas. Tech.
ChEMBL_742454 (CHEMBL1769102)
IC50
1±n/a nM
Citation
 Goldstein, DMSoth, MGabriel, TDewdney, NKuglstatter, AArzeno, HChen, JBingenheimer, WDalrymple, SADunn, JFarrell, RFrauchiger, SLa Fargue, JGhate, MGraves, BHill, RJLi, FLitman, RLoe, BMcIntosh, JMcWeeney, DPapp, EPark, JReese, HFRoberts, RTRotstein, DSan Pablo, BSarma, KStahl, MSung, MLSuttman, RTSjogren, EBTan, YTrejo, AWelch, MWeller, PWong, BRZecic, H Discovery of 6-(2,4-difluorophenoxy)-2-[3-hydroxy-1-(2-hydroxyethyl)propylamino]-8-methyl-8H-pyrido[2,3-d]pyrimidin-7-one (pamapimod) and 6-(2,4-difluorophenoxy)-8-methyl-2-(tetrahydro-2H-pyran-4-ylamino)pyrido[2,3-d]pyrimidin-7(8H)-one (R1487) as orally bioavailable and highly selective inhibitors J Med Chem 54:2255-65 (2011)  
Target
Name:
Mitogen-activated protein kinase 14
Synonyms:
CSAID-binding protein CSBP1 CSPB1 MAP kinase 14 MAP kinase p38 alpha MAPK14 MK14_HUMAN Mitogen-activated protein kinase p38 alpha Stress-activated protein kinase 2a | p38 MAP kinase alpha/beta
Type:
Serine/threonine-protein kinase
Mol. Mass.:
41286.76
Organism:
Homo sapiens (Human)
Description:
Q16539
Residue:
360
  
Inhibitor
Name:
BDBM50341370
Synonyms:
6-(2,4-Difluorophenoxy)-8-(1-methanesulfonyl-piperidin-4-yl)-2-(tetrahydropyran-4-ylamino)-8H-pyrido[2,3-d]pyrimidin-7-one | CHEMBL1766572
Type:
Small organic molecule
Emp. Form.:
C24H27F2N5O5S
Mol. Mass.:
535.563
SMILES:
CS(=O)(=O)N1CCC(CC1)n1c2nc(NC3CCOCC3)ncc2cc(Oc2ccc(F)cc2F)c1=O
: