Target
Estrogen receptor beta
Ligand
BDBM50341439
Substrate
Meas. Tech.
ChEMBL_741543 (CHEMBL1769326)
EC50
3200±n/a nM
Citation
 Möcklinghoff, Svan Otterlo, WARose, RFuchs, SZimmermann, TJDominguez Seoane, MWaldmann, HOttmann, CBrunsveld, L Design and evaluation of fragment-like estrogen receptor tetrahydroisoquinoline ligands from a scaffold-detection approach. J Med Chem 54:2005-11 (2011)  
Target
Name:
Estrogen receptor beta
Synonyms:
ER-beta ESR2_HUMAN Estradiol receptor beta (ERβ) Estrogen receptor (ER beta) Estrogen receptor beta (ER beta) NR3A2 estrogen beta
Type:
Protein
Mol. Mass.:
59238.43
Organism:
Homo sapiens (Human)
Description:
Q92731
Residue:
530
  
Inhibitor
Name:
BDBM50341439
Synonyms:
2,2,2-Trichloro-1-(6-hydroxy-3,4-dihydroisoquinolin-2(1H)-yl)ethanone | CHEMBL1766975
Type:
Small organic molecule
Emp. Form.:
C11H10Cl3NO2
Mol. Mass.:
294.562
SMILES:
Oc1ccc2CN(CCc2c1)C(=O)C(Cl)(Cl)Cl
: