Target
Estrogen receptor
Ligand
BDBM50341433
Substrate
Meas. Tech.
ChEMBL_741542 (CHEMBL1769325)
EC50
3000±n/a nM
Citation
 Möcklinghoff, Svan Otterlo, WARose, RFuchs, SZimmermann, TJDominguez Seoane, MWaldmann, HOttmann, CBrunsveld, L Design and evaluation of fragment-like estrogen receptor tetrahydroisoquinoline ligands from a scaffold-detection approach. J Med Chem 54:2005-11 (2011)  
Target
Name:
Estrogen receptor
Synonyms:
ER ESR ESR1_HUMAN Estrogen receptor Estrogen receptor (ER-alpha) Estrogen receptor alpha (ER) Nuclear receptor subfamily 3 group A member 1
Type:
Protein
Mol. Mass.:
66230.44
Organism:
Homo sapiens (Human)
Description:
P03372
Residue:
595
  
Inhibitor
Name:
BDBM50341433
Synonyms:
2-(trifluoromethylsulfonyl)-1,2,3,4-tetrahydroisoquinolin-6-ol CHEMBL1615276
Type:
Small organic molecule
Emp. Form.:
C10H10F3NO3S
Mol. Mass.:
281.252
SMILES:
Oc1ccc2CN(CCc2c1)S(=O)(=O)C(F)(F)F
: