Target
D(3) dopamine receptor
Ligand
BDBM50341508
Substrate
Meas. Tech.
ChEMBL_742114 (CHEMBL1769069)
Ki
0.71±n/a nM
Citation
 Tschammer, NElsner, JGoetz, AEhrlich, KSchuster, SRuberg, MKühhorn, JThompson, DWhistler, JHübner, HGmeiner, P Highly potent 5-aminotetrahydropyrazolopyridines: enantioselective dopamine D3 receptor binding, functional selectivity, and analysis of receptor-ligand interactions. J Med Chem 54:2477-91 (2011)  
Target
Name:
D(3) dopamine receptor
Synonyms:
DOPAMINE D3 DRD3_HUMAN Dopamine D3 receptor (D3) Dopamine receptor Dopamine receptor D3
Type:
Mol. Mass.:
44243.43
Organism:
Homo sapiens (Human)
Description:
Residue:
400
  
Inhibitor
Name:
BDBM50341508
Synonyms:
(S)-N-(4-(4-Phenylbenzoylamino)butyl)-N-propyl-5-amino-4,5,6,7-tetrahydropyrazolo[1,5-a]pyridine | CHEMBL1765633
Type:
Small organic molecule
Emp. Form.:
C27H34N4O
Mol. Mass.:
430.5851
SMILES:
CCCN(CCCCNC(=O)c1ccc(cc1)-c1ccccc1)[C@H]1CCn2nccc2C1
: