Target
Receptor-type tyrosine-protein kinase FLT3
Ligand
BDBM50341522
Substrate
Meas. Tech.
ChEMBL_742046 (CHEMBL1768909)
Ki
20±n/a nM
Citation
 Charrier, JDMiller, AKay, DPBrenchley, GTwin, HCCollier, PNRamaya, SKeily, SBDurrant, SJKnegtel, RMTanner, AJBrown, KCurnock, APJimenez, JM Discovery and structure-activity relationship of 3-aminopyrid-2-ones as potent and selective interleukin-2 inducible T-cell kinase (Itk) inhibitors. J Med Chem 54:2341-50 (2011)  
Target
Name:
Receptor-type tyrosine-protein kinase FLT3
Synonyms:
CD135 FL cytokine receptor FLK2 FLT3 Fetal liver kinase-2 Fms-like tyrosine kinase 3 (Flt-3) STK-1 Stem cell tyrosine kinase 1
Type:
Enzyme
Mol. Mass.:
112888.62
Organism:
Homo sapiens (Human)
Description:
P36888
Residue:
993
  
Inhibitor
Name:
BDBM50341522
Synonyms:
3-(4-(Piperidin-1-yl)benzoylamino)-5-(6-(methylamino)pyrimidin-4-yl)-(1H)-pyridin-2-one | CHEMBL1765775
Type:
Small organic molecule
Emp. Form.:
C22H24N6O2
Mol. Mass.:
404.465
SMILES:
CNc1cc(ncn1)-c1c[nH]c(=O)c(NC(=O)c2ccc(cc2)N2CCCCC2)c1
: