Target
Somatostatin receptor type 2
Ligand
BDBM50341564
Substrate
Meas. Tech.
ChEMBL_743881 (CHEMBL1767824)
IC50
8.3±n/a nM
Citation
 Wolkenberg, SEZhao, ZThut, CMaxwell, JWMcDonald, TPKinose, FReilly, MLindsley, CWHartman, GD Design, synthesis, and evaluation of novel 3,6-diaryl-4-aminoalkoxyquinolines as selective agonists of somatostatin receptor subtype 2. J Med Chem 54:2351-8 (2011)  
Target
Name:
Somatostatin receptor type 2
Synonyms:
SOMATOSTATIN SST2 SS-2-R SS2R SSTR2 | Somatostatin receptor type 2 (SSTR2)
Type:
Enzyme
Mol. Mass.:
41344.94
Organism:
Homo sapiens (Human)
Description:
P30874
Residue:
369
  
Inhibitor
Name:
BDBM50341564
Synonyms:
7-Chloro-3-(3,5-dimethylphenyl)-4-{2-[(2R)-piperidin-2-yl]ethoxy}-6-(pyridin-3-yl)quinoline | CHEMBL1766089
Type:
Small organic molecule
Emp. Form.:
C29H30ClN3O
Mol. Mass.:
472.021
SMILES:
Cc1cc(C)cc(c1)-c1cnc2cc(Cl)c(cc2c1OCC[C@H]1CCCCN1)-c1cccnc1
: