Target
Somatostatin receptor type 2
Ligand
BDBM50341577
Substrate
Meas. Tech.
ChEMBL_743882 (CHEMBL1767825)
Ki
0.08±n/a nM
Citation
 Wolkenberg, SEZhao, ZThut, CMaxwell, JWMcDonald, TPKinose, FReilly, MLindsley, CWHartman, GD Design, synthesis, and evaluation of novel 3,6-diaryl-4-aminoalkoxyquinolines as selective agonists of somatostatin receptor subtype 2. J Med Chem 54:2351-8 (2011)  
Target
Name:
Somatostatin receptor type 2
Synonyms:
SOMATOSTATIN SST2 SS-2-R SS2R SSTR2 | Somatostatin receptor type 2 (SSTR2)
Type:
Enzyme
Mol. Mass.:
41344.94
Organism:
Homo sapiens (Human)
Description:
P30874
Residue:
369
  
Inhibitor
Name:
BDBM50341577
Synonyms:
3-[4-(3-Aminopropoxy)-7-chloro-3-(3,5-dimethylphenyl)quinolin-6-yl]benzamide | CHEMBL1766102
Type:
Small organic molecule
Emp. Form.:
C27H26ClN3O2
Mol. Mass.:
459.967
SMILES:
Cc1cc(C)cc(c1)-c1cnc2cc(Cl)c(cc2c1OCCCN)-c1cccc(c1)C(N)=O
: