Target
Somatostatin receptor type 2
Ligand
BDBM50341580
Substrate
Meas. Tech.
ChEMBL_743881 (CHEMBL1767824)
IC50
11±n/a nM
Citation
 Wolkenberg, SEZhao, ZThut, CMaxwell, JWMcDonald, TPKinose, FReilly, MLindsley, CWHartman, GD Design, synthesis, and evaluation of novel 3,6-diaryl-4-aminoalkoxyquinolines as selective agonists of somatostatin receptor subtype 2. J Med Chem 54:2351-8 (2011)  
Target
Name:
Somatostatin receptor type 2
Synonyms:
SOMATOSTATIN SST2 SS-2-R SS2R SSTR2 | Somatostatin receptor type 2 (SSTR2)
Type:
Enzyme
Mol. Mass.:
41344.94
Organism:
Homo sapiens (Human)
Description:
P30874
Residue:
369
  
Inhibitor
Name:
BDBM50341580
Synonyms:
CHEMBL1766105 | [(4-{2-[(2R)-Piperidin-2-yl]ethoxy}quinoline-3,6-diyl)dibenzene-3,1-diyl]dimethanol
Type:
Small organic molecule
Emp. Form.:
C30H32N2O3
Mol. Mass.:
468.5867
SMILES:
OCc1cccc(c1)-c1ccc2ncc(-c3cccc(CO)c3)c(OCC[C@H]3CCCCN3)c2c1
: