Target
DNA-dependent protein kinase catalytic subunit
Ligand
BDBM50341711
Substrate
Meas. Tech.
ChEMBL_743384 (CHEMBL1767683)
IC50
>1000000000±n/a nM
Citation
 Charrier, JDDurrant, SJGolec, JMKay, DPKnegtel, RMMacCormick, SMortimore, MO'Donnell, MEPinder, JLReaper, PMRutherford, APWang, PSYoung, SCPollard, JR Discovery of potent and selective inhibitors of ataxia telangiectasia mutated and Rad3 related (ATR) protein kinase as potential anticancer agents. J Med Chem 54:2320-30 (2011)  
Target
Name:
DNA-dependent protein kinase catalytic subunit
Synonyms:
DNA-PK catalytic subunit DNA-dependent protein kinase (DNA-PK) DNA-dependent protein kinase catalytic subunit (DNA-PK) HYRC PRKDC | PRKDC_HUMAN
Type:
Protein
Mol. Mass.:
469114.78
Organism:
Homo sapiens (Human)
Description:
P78527
Residue:
4128
  
Inhibitor
Name:
BDBM50341711
Synonyms:
CHEMBL479488 | schisandrin B
Type:
Small organic molecule
Emp. Form.:
C23H28O6
Mol. Mass.:
400.4648
SMILES:
COc1cc2CC(C)C(C)Cc3cc4OCOc4c(OC)c3-c2c(OC)c1OC
: