Target
Cytochrome P450 3A4
Ligand
BDBM50342191
Substrate
Meas. Tech.
ChEMBL_742805 (CHEMBL1769808)
IC50
>10000±n/a nM
Citation
 Kaku, TTsujimoto, SMatsunaga, NTanaka, THara, TYamaoka, MKusaka, MTasaka, A 17,20-Lyase inhibitors. Part 3: Design, synthesis, and structure-activity relationships of biphenylylmethylimidazole derivatives as novel 17,20-lyase inhibitors. Bioorg Med Chem 19:2428-42 (2011)  
Target
Name:
Cytochrome P450 3A4
Synonyms:
Albendazole monooxygenase CP3A4_HUMAN CYP3A4 CYPIIIA4 Cytochrome P450 3A4 (CYP3A4) Nifedipine oxidase Taurochenodeoxycholate 6-alpha-hydroxylase
Type:
Enzyme
Mol. Mass.:
57349.57
Organism:
Homo sapiens (Human)
Description:
Residue:
503
  
Inhibitor
Name:
BDBM50342191
Synonyms:
(R)-N-(4'-(1-hydroxy-1-(1H-imidazol-4-yl)propyl)biphenyl-3-yl)acetamide | CHEMBL1766192
Type:
Small organic molecule
Emp. Form.:
C20H21N3O2
Mol. Mass.:
335.3996
SMILES:
CC[C@](O)(c1cnc[nH]1)c1ccc(cc1)-c1cccc(NC(C)=O)c1
: