Target
Proto-oncogene tyrosine-protein kinase Src
Ligand
BDBM50342389
Substrate
Meas. Tech.
ChEMBL_743061 (CHEMBL1768532)
IC50
107±n/a nM
Citation
 Pevet, IBrulé, CTizot, AGohier, ACruzalegui, FBoutin, JAGoldstein, S Synthesis and pharmacological evaluation of thieno[2,3-b]pyridine derivatives as novel c-Src inhibitors. Bioorg Med Chem 19:2517-28 (2011)  
Target
Name:
Proto-oncogene tyrosine-protein kinase Src
Synonyms:
Calmodulin/Proto-oncogene tyrosine-protein kinase Src Proto-oncogene c-Src SRC SRC_HUMAN V-src sarcoma (Schmidt-Ruppin A-2) viral oncogene homolog (avian) p60-Src | pp60c-src
Type:
Protein
Mol. Mass.:
59838.60
Organism:
Homo sapiens (Human)
Description:
P12931
Residue:
536
  
Inhibitor
Name:
BDBM50342389
Synonyms:
3-Amino-6-(2-dimethylamino-ethylamino)-4-phenylthieno[2,3-b]pyridine-2-carboxylic acid naphthalen-1-yl-methylene-hydrazide | CHEMBL1765557
Type:
Small organic molecule
Emp. Form.:
C29H28N6OS
Mol. Mass.:
508.637
SMILES:
CN(C)CCNc1cc(-c2ccccc2)c2c(N)c(sc2n1)C(=O)N\N=C\c1cccc2ccccc12
: