Target
Adenosine receptor A2a
Ligand
BDBM50342511
Substrate
Meas. Tech.
ChEMBL_744656 (CHEMBL1772677)
Ki
10.2±n/a nM
Citation
 Kumar, TSMishra, SDeflorian, FYoo, LSPhan, KKecskés, MSzabo, AShinkre, BGao, ZGTrenkle, WJacobson, KA Molecular probes for the A2A adenosine receptor based on a pyrazolo[4,3-e][1,2,4]triazolo[1,5-c]pyrimidin-5-amine scaffold. Bioorg Med Chem Lett 21:2740-5 (2011)  
Target
Name:
Adenosine receptor A2a
Synonyms:
A2A adenosine receptor (hA2A) ADENOSINE A2 ADORA2 Adenosine A2A receptor (A2AAR)
Type:
G Protein-Coupled Receptor (GPCR)
Mol. Mass.:
44716.46
Organism:
Homo sapiens (Human)
Description:
P29274
Residue:
412
  
Inhibitor
Name:
BDBM50342511
Synonyms:
2-(4-(3-(5-Amino-2-(furan-2-yl)-7H-pyrazolo[4,3-e][1,2,4]triazolo[1,5-c]pyrimidin-7-yl)propyl)phenoxy)acetic acid | CHEMBL1771806
Type:
Small organic molecule
Emp. Form.:
C21H19N7O4
Mol. Mass.:
433.4201
SMILES:
Nc1nc2n(CCCc3ccc(OCC(O)=O)cc3)ncc2c2nc(nn12)-c1ccco1
: