Target
Adenosine receptor A2a
Ligand
BDBM50094037
Substrate
Meas. Tech.
ChEMBL_744656 (CHEMBL1772677)
Ki
4.1±n/a nM
Citation
 Kumar, TSMishra, SDeflorian, FYoo, LSPhan, KKecskés, MSzabo, AShinkre, BGao, ZGTrenkle, WJacobson, KA Molecular probes for the A2A adenosine receptor based on a pyrazolo[4,3-e][1,2,4]triazolo[1,5-c]pyrimidin-5-amine scaffold. Bioorg Med Chem Lett 21:2740-5 (2011)  
Target
Name:
Adenosine receptor A2a
Synonyms:
A2A adenosine receptor (hA2A) ADENOSINE A2 ADORA2 Adenosine A2A receptor (A2AAR)
Type:
G Protein-Coupled Receptor (GPCR)
Mol. Mass.:
44716.46
Organism:
Homo sapiens (Human)
Description:
P29274
Residue:
412
  
Inhibitor
Name:
BDBM50094037
Synonyms:
2-Furan-2-yl-7-[3-(4-methoxy-phenyl)-propyl]-7H-pyrazolo[4,3-e][1,2,4]triazolo[1,5-c]pyrimidin-5-ylamine SCH-442416
Type:
Small organic molecule
Emp. Form.:
C20H19N7O2
Mol. Mass.:
389.4106
SMILES:
COc1ccc(CCCn2ncc3c2nc(N)n2nc(nc32)-c2ccco2)cc1
: