Target
Acid-sensing ion channel 3
Ligand
BDBM50342644
Substrate
Meas. Tech.
ChEMBL_745055 (CHEMBL1772131)
IC50
103000±n/a nM
Citation
 Wolkenberg, SEZhao, ZMulhearn, JJHarrison, STSanders, JMCato, MJJovanovska, APanigel, JCook, SPHenze, DAKane, SAHartman, GDBarrow, JC High concentration electrophysiology-based fragment screen: discovery of novel acid-sensing ion channel 3 (ASIC3) inhibitors. Bioorg Med Chem Lett 21:2646-9 (2011)  
Target
Name:
Acid-sensing ion channel 3
Synonyms:
ACCN3 ASIC3_HUMAN SLNAC1 | TNAC1
Type:
PROTEIN
Mol. Mass.:
58910.26
Organism:
Homo sapiens (Human)
Description:
ChEMBL_757561
Residue:
531
  
Inhibitor
Name:
BDBM50342644
Synonyms:
2-((5-methoxy-1H-indol-3-yl)methyl)-6-(3-(trifluoromethyl)phenyl)-1,2,3,4-tetrahydroisoquinoline | CHEMBL1770747
Type:
Small organic molecule
Emp. Form.:
C26H23F3N2O
Mol. Mass.:
436.4688
SMILES:
COc1ccc2[nH]cc(CN3CCc4cc(ccc4C3)-c3cccc(c3)C(F)(F)F)c2c1
: