Target
Acid-sensing ion channel 3
Ligand
BDBM50342650
Substrate
Meas. Tech.
ChEMBL_745055 (CHEMBL1772131)
IC50
9600±n/a nM
Citation
 Wolkenberg, SEZhao, ZMulhearn, JJHarrison, STSanders, JMCato, MJJovanovska, APanigel, JCook, SPHenze, DAKane, SAHartman, GDBarrow, JC High concentration electrophysiology-based fragment screen: discovery of novel acid-sensing ion channel 3 (ASIC3) inhibitors. Bioorg Med Chem Lett 21:2646-9 (2011)  
Target
Name:
Acid-sensing ion channel 3
Synonyms:
ACCN3 ASIC3_HUMAN SLNAC1 | TNAC1
Type:
PROTEIN
Mol. Mass.:
58910.26
Organism:
Homo sapiens (Human)
Description:
ChEMBL_757561
Residue:
531
  
Inhibitor
Name:
BDBM50342650
Synonyms:
4-amino-N-(4-chlorophenethyl)-2-propylquinoline-6-carboxamide | CHEMBL1770753
Type:
Small organic molecule
Emp. Form.:
C21H22ClN3O
Mol. Mass.:
367.872
SMILES:
CCCc1cc(N)c2cc(ccc2n1)C(=O)NCCc1ccc(Cl)cc1
: