Target
Synaptic vesicular amine transporter
Ligand
BDBM50342823
Substrate
Meas. Tech.
ChEMBL_744748 (CHEMBL1772769)
Ki
4630±n/a nM
Citation
 Yao, ZWei, XWu, XKatz, JLKopajtic, TGreig, NHSun, H Preparation and evaluation of tetrabenazine enantiomers and all eight stereoisomers of dihydrotetrabenazine as VMAT2 inhibitors. Eur J Med Chem 46:1841-8 (2011)  
Target
Name:
Synaptic vesicular amine transporter
Synonyms:
Monoamine transporter Solute carrier family 18 member 2 Synaptic vesicular amine transporter VMAT2_RAT Vesicular monoamine transporter 2 (VMAT2) | Vmat2
Type:
Protein
Mol. Mass.:
55689.58
Organism:
Rattus norvegicus (Rat)
Description:
Q01827
Residue:
515
  
Inhibitor
Name:
BDBM50342823
Synonyms:
(2S,3R,11bS)-3-Isobutyl-9,10-dimethoxy-1,3,4,6,7,11bhexahydro-2H-pyrido[2,1-a]isoquinolin-2-ol | CHEMBL1770804
Type:
Small organic molecule
Emp. Form.:
C19H29NO3
Mol. Mass.:
319.4385
SMILES:
COc1cc2CCN3C[C@@H](CC(C)C)[C@@H](O)C[C@H]3c2cc1OC
: