Target
Histamine H4 receptor
Ligand
BDBM50342986
Substrate
Meas. Tech.
ChEMBL_744294 (CHEMBL1772151)
Ki
40±n/a nM
Citation
 Meduna, SPSavall, BMCai, HEdwards, JPThurmond, RLMcGovern, PM Triamino pyrimidines and pyridines as histamine H(4) receptor modulators. Bioorg Med Chem Lett 21:3113-6 (2011)  
Target
Name:
Histamine H4 receptor
Synonyms:
AXOR35 GPCR105 HH4R HRH4 Histamine H4 receptor Histamine receptor (H3 and H4) SP9144
Type:
G Protein-Coupled Receptor (GPCR)
Mol. Mass.:
44517.02
Organism:
Homo sapiens (Human)
Description:
Binding assays were using CHO cells stably expressing hH4R receptors.
Residue:
390
  
Inhibitor
Name:
BDBM50342986
Synonyms:
CHEMBL1770997 | rac-4-(pyrrolidin-1-yl)-6-(tetrahydro-1H-pyrrolo[3,4-b]pyridin-6(2H,7H,7aH)-yl)pyrimidin-2-amine
Type:
Small organic molecule
Emp. Form.:
C15H24N6
Mol. Mass.:
288.3913
SMILES:
Nc1nc(cc(n1)N1CC2CCCNC2C1)N1CCCC1
: