Target
Histamine H4 receptor
Ligand
BDBM50342988
Substrate
Meas. Tech.
ChEMBL_744294 (CHEMBL1772151)
Ki
24±n/a nM
Citation
 Meduna, SPSavall, BMCai, HEdwards, JPThurmond, RLMcGovern, PM Triamino pyrimidines and pyridines as histamine H(4) receptor modulators. Bioorg Med Chem Lett 21:3113-6 (2011)  
Target
Name:
Histamine H4 receptor
Synonyms:
AXOR35 GPCR105 HH4R HRH4 Histamine H4 receptor Histamine receptor (H3 and H4) SP9144
Type:
G Protein-Coupled Receptor (GPCR)
Mol. Mass.:
44517.02
Organism:
Homo sapiens (Human)
Description:
Binding assays were using CHO cells stably expressing hH4R receptors.
Residue:
390
  
Inhibitor
Name:
BDBM50342988
Synonyms:
CHEMBL1770999 | N4-isopropyl-N4-methyl-6-(4-methylpiperazin-1-yl)pyrimidine-2,4-diamine
Type:
Small organic molecule
Emp. Form.:
C13H24N6
Mol. Mass.:
264.3699
SMILES:
CC(C)N(C)c1cc(nc(N)n1)N1CCN(C)CC1
: