Target
Histamine H4 receptor
Ligand
BDBM50343017
Substrate
Meas. Tech.
ChEMBL_744294 (CHEMBL1772151)
Ki
148±n/a nM
Citation
 Meduna, SPSavall, BMCai, HEdwards, JPThurmond, RLMcGovern, PM Triamino pyrimidines and pyridines as histamine H(4) receptor modulators. Bioorg Med Chem Lett 21:3113-6 (2011)  
Target
Name:
Histamine H4 receptor
Synonyms:
AXOR35 GPCR105 HH4R HRH4 Histamine H4 receptor Histamine receptor (H3 and H4) SP9144
Type:
G Protein-Coupled Receptor (GPCR)
Mol. Mass.:
44517.02
Organism:
Homo sapiens (Human)
Description:
Binding assays were using CHO cells stably expressing hH4R receptors.
Residue:
390
  
Inhibitor
Name:
BDBM50343017
Synonyms:
CHEMBL1770967 | N2-benzyl-4-(4-methylpiperazin-1-yl)pyridine-2,6-diamine
Type:
Small organic molecule
Emp. Form.:
C17H23N5
Mol. Mass.:
297.398
SMILES:
CN1CCN(CC1)c1cc(N)nc(NCc2ccccc2)c1
: