Target
Histamine H4 receptor
Ligand
BDBM50343020
Substrate
Meas. Tech.
ChEMBL_744294 (CHEMBL1772151)
Ki
29±n/a nM
Citation
 Meduna, SPSavall, BMCai, HEdwards, JPThurmond, RLMcGovern, PM Triamino pyrimidines and pyridines as histamine H(4) receptor modulators. Bioorg Med Chem Lett 21:3113-6 (2011)  
Target
Name:
Histamine H4 receptor
Synonyms:
AXOR35 GPCR105 HH4R HRH4 Histamine H4 receptor Histamine receptor (H3 and H4) SP9144
Type:
G Protein-Coupled Receptor (GPCR)
Mol. Mass.:
44517.02
Organism:
Homo sapiens (Human)
Description:
Binding assays were using CHO cells stably expressing hH4R receptors.
Residue:
390
  
Inhibitor
Name:
BDBM50343020
Synonyms:
(R)-N2-isopropyl-N2-methyl-4-(3-(methylamino)pyrrolidin-1-yl)pyridine-2,6-diamine | CHEMBL1770970
Type:
Small organic molecule
Emp. Form.:
C14H25N5
Mol. Mass.:
263.3818
SMILES:
CN[C@@H]1CCN(C1)c1cc(N)nc(c1)N(C)C(C)C
: